BDBM43880 MLS000666595::N'-[1-(5-bromo-2-thienyl)ethylidene]-1,3-benzodioxole-5-carbohydrazide::N-[1-(5-bromanylthiophen-2-yl)ethylideneamino]-1,3-benzodioxole-5-carboxamide::N-[1-(5-bromo-2-thienyl)ethylideneamino]-piperonylamide::N-[1-(5-bromo-2-thiophenyl)ethylideneamino]-1,3-benzodioxole-5-carboxamide::N-[1-(5-bromothiophen-2-yl)ethylideneamino]-1,3-benzodioxole-5-carboxamide::SMR000268265::cid_1370977
SMILES CC(=NNC(=O)c1ccc2OCOc2c1)c1ccc(Br)s1
InChI Key InChIKey=SDOAIZHQPATQLO-UHFFFAOYSA-N
Data  1 EC50
  Tab Delimited (TSV)   2D SDfile   Computed 3D by Vconf -m prep SDfile
Find this compound or compounds like it in BindingDB:
Activity Spreadsheet -- Enzyme Inhibition Constant Data from BindingDB
Found 1 hit for monomerid = 43880
TargetSolute carrier family 12 member 5(Homo sapiens (Human))
Vanderbilt Screening Center For Gpcrs, Ion Channels and Transporters
Curated by PubChem BioAssay
LigandPNGBDBM43880(MLS000666595 | N'-[1-(5-bromo-2-thienyl)ethyli...)
Affinity DataEC50:  7.26E+5nM. Assay description: Vanderbilt Screening Center for GPCRs, Ion Channels and Transporters Assay Provider: Eric Delpire Assay Provider Affliation: Vanderbilt University Gr...
In DepthDetails PCBioAssay