BDBM438815 4-(2-(2-((2-chloro-2'-cyano- 3'-(5-(2-hydroxyethyl)-1- methyl-4,5,6,7-tetrahydro- 1H-imidazo[4,5-c]pyridine- 2-carboxamido)-[1,1'- biphenyl]-3-yl)carbamoyl)- 1-methyl-1,4,6,7-tetrahydro- 5H-imidazo[4,5-c]pyridin- 5-yl)ethyl)bicyclo[2.2.1] heptane-1-carboxylic acid::US10618916, Example 50::US10906920, Example 50::US11414433, Example 50
SMILES Cn1c2CCN(CCC34CCC(CC3)(C4)C(O)=O)Cc2nc1C(=O)Nc1cccc(c1Cl)-c1cccc(NC(=O)c2nc3CN(CCO)CCc3n2C)c1C#N
InChI Key InChIKey=ITLHLFGDGNFKBL-UHFFFAOYSA-N
Data  3 IC50
  Tab Delimited (TSV)   2D SDfile   Computed 3D by Vconf -m prep SDfile
Find this compound or compounds like it in BindingDB:
Activity Spreadsheet -- Enzyme Inhibition Constant Data from BindingDB
Found 3 hits for monomerid = 438815
TargetProgrammed cell death 1 ligand 1 [19-238]/protein 1 [25-167](Homo sapiens (Human))
Incyte
US Patent
LigandPNGBDBM438815(4-(2-(2-((2-chloro-2'-cyano- 3'-(5-(2-hydroxyethyl...)
Affinity DataIC50: <5nM. Assay description: The assays were conducted in a standard black 384-well polystyrene plate with a final volume of 20 μL. Inhibitors were first serially diluted in...
Ligand InfoPC cidPC sid
In DepthDetails US Patent
TargetProgrammed cell death 1 ligand/protein 1(Homo sapiens)
Incyte
US Patent
LigandPNGBDBM438815(4-(2-(2-((2-chloro-2'-cyano- 3'-(5-(2-hydroxyethyl...)
Affinity DataIC50: <5nM. Assay description: The assays were conducted in a standard black 384-well polystyrene plate with a final volume of 20 μL. Inhibitors were first serially diluted in...
Ligand InfoPC cidPC sid
In DepthDetails US Patent
TargetProgrammed cell death 1 ligand 1 [19-238]/protein 1 [25-167](Homo sapiens (Human))
Incyte
US Patent
LigandPNGBDBM438815(4-(2-(2-((2-chloro-2'-cyano- 3'-(5-(2-hydroxyethyl...)
Affinity DataIC50: <5nM. Assay description: The assays were conducted in a standard black 384-well polystyrene plate with a final volume of 20 μL. Inhibitors were first serially diluted in...
Ligand InfoPC cidPC sid
In DepthDetails US Patent