BDBM43886 MLS000332605::N'-[1-oxo-2-(4-propan-2-ylphenoxy)ethyl]-2-pyrazinecarbohydrazide::N'-[2-(4-isopropylphenoxy)acetyl]pyrazinohydrazide::N'-[2-(4-propan-2-ylphenoxy)acetyl]pyrazine-2-carbohydrazide::N'-[2-(4-propan-2-ylphenoxy)ethanoyl]pyrazine-2-carbohydrazide::Pyrazine-2-carboxylic acid N'-[2-(4-isopropyl-phenoxy)-acetyl]-hydrazide::SMR000435954::cid_934383
SMILES CC(C)c1ccc(OCC(=O)NNC(=O)c2cnccn2)cc1
InChI Key InChIKey=QEZNYWJORFQKDY-UHFFFAOYSA-N
Data  2 EC50
  Tab Delimited (TSV)   2D SDfile   Computed 3D by Vconf -m prep SDfile
Find this compound or compounds like it in BindingDB:
Activity Spreadsheet -- Enzyme Inhibition Constant Data from BindingDB
Found 2 hits for monomerid = 43886
TargetSolute carrier family 12 member 5(Homo sapiens (Human))
Vanderbilt Screening Center For Gpcrs, Ion Channels and Transporters
Curated by PubChem BioAssay
LigandPNGBDBM43886(MLS000332605 | N'-[1-oxo-2-(4-propan-2-ylphenoxy)e...)
Affinity DataEC50:  1.70E+4nM. Assay description: Vanderbilt Screening Center for GPCRs, Ion Channels and Transporters Assay Provider: Eric Delpire Assay Provider Affliation: Vanderbilt University Gr...
In DepthDetails PCBioAssay
TargetSolute carrier family 12 member 5(Homo sapiens (Human))
Vanderbilt Screening Center For Gpcrs, Ion Channels and Transporters
Curated by PubChem BioAssay
LigandPNGBDBM43886(MLS000332605 | N'-[1-oxo-2-(4-propan-2-ylphenoxy)e...)
Affinity DataEC50:  1.56E+4nM. Assay description: Vanderbilt Screening Center for GPCRs, Ion Channels and Transporters Assay Provider: Eric Delpire Assay Provider Affliation: Vanderbilt University Gr...
In DepthDetails PCBioAssay