BDBM441829 US10647665, Example 1-16::US10851050, Example I-16
SMILES OC(=O)Cc1ccc(CNC(=O)Nc2cc(Cl)c(c(c2)C#N)-c2ccccc2OC(F)(F)F)cc1
InChI Key InChIKey=XLSLLICYQMPSGZ-UHFFFAOYSA-N
Data  2 IC50
  Tab Delimited (TSV)   2D SDfile   Computed 3D by Vconf -m prep SDfile
Find this compound or compounds like it in BindingDB:
Activity Spreadsheet -- Enzyme Inhibition Constant Data from BindingDB
Found 2 hits for monomerid = 441829
TargetNuclear receptor ROR-gamma(Homo sapiens (Human))
Fudan University
US Patent
LigandPNGBDBM441829(US10647665, Example 1-16 | US10851050, Example I-1...)
Affinity DataIC50: <500nM. Assay description: The inhibitory activity of compounds on RORγ receptor was determined by fluorescence resonance energy transfer (FRET) experiments. The inhibitor...
Ligand InfoKEGGPC cidPC sid
In DepthDetails US Patent
TargetNuclear receptor ROR-gamma(Homo sapiens (Human))
Fudan University
US Patent
LigandPNGBDBM441829(US10647665, Example 1-16 | US10851050, Example I-1...)
Affinity DataIC50: <500nM. Assay description: 1. Preparation of RORgamma Buffer Solution10 mL of DTT and 100 mL buffer solution were gently mixed together and ready to use.2. Preparation of Compo...
Ligand InfoKEGGPC cidPC sid
In DepthDetails US Patent