BDBM444679 (R)-1-(3-(3-(4-(3-fluoro-2- methoxyphenoxy)phenyl)-1H- pyrazolo[4,3-c]pyridin-1-yl)pyrrolidin-1- yl)prop-2-en-1-one::US10662187, Compound 49::US10793566, Compound 49
SMILES COc1c(F)cccc1Oc1ccc(cc1)-c1nn([C@@H]2CCN(C2)C(=O)C=C)c2ccncc12
InChI Key InChIKey=LQHADDXGRCQWHT-GOSISDBHSA-N
Data  2 IC50
  Tab Delimited (TSV)   2D SDfile   Computed 3D by Vconf -m prep SDfile
Find this compound or compounds like it in BindingDB:
Activity Spreadsheet -- Enzyme Inhibition Constant Data from BindingDB
Found 1 hit for monomerid = 444679
TargetTyrosine-protein kinase BTK(Homo sapiens (Human))
Zibo Biopolar Changsheng Pharmaceutical
US Patent
LigandPNGBDBM444679((R)-1-(3-(3-(4-(3-fluoro-2- methoxyphenoxy)phenyl)...)
Affinity DataIC50:  55nM. Assay description: Btk kinase activity was determined using a homogenous time resolved fluorescence (HTRF) methodology. Measurements were performed in a reaction volume...
Ligand InfoPC cidPC sid
In DepthDetails US Patent