BDBM444753 4-(3-(4-benzamidophenyl)-1H- pyrazolo[4,3-c] pyridin-1-yl)cyclohexanecarboxylic acid::US10662187, Compound 123::US10793566, Compound 123
SMILES OC(=O)C1CCC(CC1)n1nc(-c2ccc(NC(=O)c3ccccc3)cc2)c2cnccc12
InChI Key InChIKey=POONEVBKDCETSH-UHFFFAOYSA-N
Data  2 IC50
  Tab Delimited (TSV)   2D SDfile   Computed 3D by Vconf -m prep SDfile
Find this compound or compounds like it in BindingDB:
Activity Spreadsheet -- Enzyme Inhibition Constant Data from BindingDB
Found 2 hits for monomerid = 444753
TargetTyrosine-protein kinase BTK(Homo sapiens (Human))
Zibo Biopolar Changsheng Pharmaceutical
US Patent
LigandPNGBDBM444753(4-(3-(4-benzamidophenyl)-1H- pyrazolo[4,3-c] pyrid...)
Affinity DataIC50: >1.00E+4nM. Assay description: Btk kinase activity was determined using a homogenous time resolved fluorescence (HTRF) methodology. Measurements were performed in a reaction volume...
Ligand InfoPC cidPC sid
In DepthDetails US Patent
TargetTyrosine-protein kinase BTK(Homo sapiens (Human))
Zibo Biopolar Changsheng Pharmaceutical
US Patent
LigandPNGBDBM444753(4-(3-(4-benzamidophenyl)-1H- pyrazolo[4,3-c] pyrid...)
Affinity DataIC50: >1.00E+4nM. Assay description: Measurements were performed in a reaction volume of 15 μL using 384-well assay plates. Kinase enzyme, inhibitor, ATP and 1 μM peptide subst...
Ligand InfoPC cidPC sid
In DepthDetails US Patent