BDBM44523 (4Z)-2-(ethylthio)-4-[[5-(2-nitrophenyl)-2-furanyl]methylidene]-5-thiazolone::(4Z)-2-(ethylthio)-4-[[5-(2-nitrophenyl)-2-furyl]methylene]-2-thiazolin-5-one::(4Z)-2-ethylsulfanyl-4-[[5-(2-nitrophenyl)furan-2-yl]methylidene]-1,3-thiazol-5-one::2-(ethylthio)-4-{[5-(2-nitrophenyl)-2-furyl]methylene}-1,3-thiazol-5(4H)-one::MLS000574230::SMR000195821::cid_2230620
SMILES CCSC1=N\C(=C/c2ccc(o2)-c2ccccc2[N+]([O-])=O)C(=O)S1
InChI Key InChIKey=VYSPHADEYKHZOS-XFXZXTDPSA-N
Data  3 IC50
  Tab Delimited (TSV)   2D SDfile   Computed 3D by Vconf -m prep SDfile
Find this compound or compounds like it in BindingDB:
Activity Spreadsheet -- Enzyme Inhibition Constant Data from BindingDB
Found 3 hits for monomerid = 44523
TargetEphrin type-A receptor 4(Mus musculus)
Sanford-Burnham Center For Chemical Genomics
Curated by PubChem BioAssay
LigandPNGBDBM44523((4Z)-2-(ethylthio)-4-[[5-(2-nitrophenyl)-2-furanyl...)
Affinity DataIC50: >1.00E+5nM. Assay description: Data Source: Sanford-Burnham Center for Chemical Genomics (SBCCG) Source Affiliation: Sanford-Burnham Medical Research Institute (SBMRI, San Diego, C...
In DepthDetails PCBioAssay
TargetProtein artemis(Homo sapiens (Human))
Burnham Center For Chemical Genomics
Curated by PubChem BioAssay
LigandPNGBDBM44523((4Z)-2-(ethylthio)-4-[[5-(2-nitrophenyl)-2-furanyl...)
Affinity DataIC50:  967nM. Assay description: Data Source: Sanford-Burnham Center for Chemical Genomics (SBCCG) Source Affiliation: Sanford-Burnham Medical Research Institute (SBMRI, San Diego CA...
In DepthDetails PCBioAssay
TargetEphrin type-A receptor 4(Mus musculus)
Sanford-Burnham Center For Chemical Genomics
Curated by PubChem BioAssay
LigandPNGBDBM44523((4Z)-2-(ethylthio)-4-[[5-(2-nitrophenyl)-2-furanyl...)
Affinity DataIC50: >5.00E+4nM. Assay description: Sanford-Burnham Center for Chemical Genomics (SBCCG) Sanford-Burnham Medical Research Institute (SBMRI, San Diego, CA) NIH Molecular Libraries Screen...
In DepthDetails PCBioAssay