BDBM44608 MLS000082806::N-(5-ethyl-1,3,4-thiadiazol-2-yl)-4-[4-[2-(4-methylphenoxy)ethyl]-1-piperazinyl]-4-oxobutanamide::N-(5-ethyl-1,3,4-thiadiazol-2-yl)-4-[4-[2-(4-methylphenoxy)ethyl]piperazin-1-yl]-4-oxidanylidene-butanamide::N-(5-ethyl-1,3,4-thiadiazol-2-yl)-4-[4-[2-(4-methylphenoxy)ethyl]piperazin-1-yl]-4-oxobutanamide::N-(5-ethyl-1,3,4-thiadiazol-2-yl)-4-keto-4-[4-[2-(4-methylphenoxy)ethyl]piperazino]butyramide::SMR000059786::cid_663447
SMILES CCc1nnc(NC(=O)CCC(=O)N2CCN(CCOc3ccc(C)cc3)CC2)s1
InChI Key InChIKey=LNGWVZBNOGLPNY-UHFFFAOYSA-N
Data  1 IC50  1 EC50
  Tab Delimited (TSV)   2D SDfile   Computed 3D by Vconf -m prep SDfile
Find this compound or compounds like it in BindingDB:
Activity Spreadsheet -- Enzyme Inhibition Constant Data from BindingDB
Found 2 hits for monomerid = 44608
TargetCoagulation factor XII(Homo sapiens (Human))
Pcmd
Curated by PubChem BioAssay
LigandPNGBDBM44608(MLS000082806 | N-(5-ethyl-1,3,4-thiadiazol-2-yl)-4...)
Affinity DataIC50: >5.00E+4nM. Assay description: Molecular Library Screening Center Network (MLSCN) Penn Center for Molecular Discovery (PCMD) Assay Provider: Scott L. Diamond, University of Pennsy...
In DepthDetails PCBioAssay
TargetMultidrug resistance-associated protein 1(Homo sapiens (Human))
Srmlsc
Curated by PubChem BioAssay
LigandPNGBDBM44608(MLS000082806 | N-(5-ethyl-1,3,4-thiadiazol-2-yl)-4...)
Affinity DataEC50:  6.71E+3nM. Assay description: Southern Research Molecular Libraries Screening Center (SRMLSC) Southern Research Institute (Birmingham, Alabama) NIH Molecular Libraries Screening C...
In DepthDetails PCBioAssay