BDBM44613 4-(2,6-dimethyl-4-oxidanylidene-5-phenyl-pyrimidin-1-yl)benzenesulfonamide::4-(2,6-dimethyl-4-oxo-5-phenyl-1-pyrimidinyl)benzenesulfonamide::4-(2,6-dimethyl-4-oxo-5-phenylpyrimidin-1-yl)benzenesulfonamide::4-(4-keto-2,6-dimethyl-5-phenyl-pyrimidin-1-yl)benzenesulfonamide::MLS000030410::SMR000037068::cid_665275
SMILES Cc1nc(=O)c(c(C)n1-c1ccc(cc1)S(N)(=O)=O)-c1ccccc1
InChI Key InChIKey=WNULOJOYDDKSGK-UHFFFAOYSA-N
Data  1 EC50
  Tab Delimited (TSV)   2D SDfile   Computed 3D by Vconf -m prep SDfile
Find this compound or compounds like it in BindingDB:
Activity Spreadsheet -- Enzyme Inhibition Constant Data from BindingDB
Found 1 hit for monomerid = 44613
TargetMultidrug resistance-associated protein 1(Homo sapiens (Human))
Srmlsc
Curated by PubChem BioAssay
LigandPNGBDBM44613(4-(2,6-dimethyl-4-oxidanylidene-5-phenyl-pyrimidin...)
Affinity DataEC50:  8.25E+3nM. Assay description: Southern Research Molecular Libraries Screening Center (SRMLSC) Southern Research Institute (Birmingham, Alabama) NIH Molecular Libraries Screening C...
In DepthDetails PCBioAssay