BDBM44615 3-methyl-6-(4-pyridyl)-[1,2,4]triazolo[3,4-b][1,3,4]thiadiazole::3-methyl-6-pyridin-4-yl-[1,2,4]triazolo[3,4-b][1,3,4]thiadiazole::MLS000042613::SMR000047306::cid_666150
SMILES Cc1nnc2sc(nn12)-c1ccncc1
InChI Key InChIKey=ZYHZWZFGCYQLAX-UHFFFAOYSA-N
Data  1 EC50
  Tab Delimited (TSV)   2D SDfile   Computed 3D by Vconf -m prep SDfile
Find this compound or compounds like it in BindingDB:
Activity Spreadsheet -- Enzyme Inhibition Constant Data from BindingDB
Found 1 hit for monomerid = 44615
TargetMultidrug resistance-associated protein 1(Homo sapiens (Human))
Srmlsc
Curated by PubChem BioAssay
LigandPNGBDBM44615(3-methyl-6-(4-pyridyl)-[1,2,4]triazolo[3,4-b][1,3,...)
Affinity DataEC50:  4.31E+3nM. Assay description: Southern Research Molecular Libraries Screening Center (SRMLSC) Southern Research Institute (Birmingham, Alabama) NIH Molecular Libraries Screening C...
In DepthDetails PCBioAssay