BDBM44617 3-amino-6-(2-furanyl)-N-(2-methoxyphenyl)-2-thieno[2,3-b]pyridinecarboxamide::3-amino-6-(2-furyl)-N-(2-methoxyphenyl)thieno[2,3-b]pyridine-2-carboxamide::3-amino-6-(furan-2-yl)-N-(2-methoxyphenyl)thieno[2,3-b]pyridine-2-carboxamide::3-azanyl-6-(furan-2-yl)-N-(2-methoxyphenyl)thieno[2,3-b]pyridine-2-carboxamide::MLS000042416::SMR000047715::cid_666371
SMILES COc1ccccc1NC(=O)c1sc2nc(ccc2c1N)-c1ccco1
InChI Key InChIKey=GYCCOLGXVVRUMG-UHFFFAOYSA-N
Data  2 IC50  1 EC50
  Tab Delimited (TSV)   2D SDfile   Computed 3D by Vconf -m prep SDfile
Find this compound or compounds like it in BindingDB:
Activity Spreadsheet -- Enzyme Inhibition Constant Data from BindingDB
Found 3 hits for monomerid = 44617
TargetMultidrug resistance-associated protein 1(Homo sapiens (Human))
Srmlsc
Curated by PubChem BioAssay
LigandPNGBDBM44617(3-amino-6-(2-furanyl)-N-(2-methoxyphenyl)-2-thieno...)
Affinity DataEC50:  4.61E+3nM. Assay description: Southern Research Molecular Libraries Screening Center (SRMLSC) Southern Research Institute (Birmingham, Alabama) NIH Molecular Libraries Screening C...
In DepthDetails PCBioAssay
TargetSUMO-conjugating enzyme UBC9(Homo sapiens (Human))
Burnham Center For Chemical Genomics
Curated by PubChem BioAssay
LigandPNGBDBM44617(3-amino-6-(2-furanyl)-N-(2-methoxyphenyl)-2-thieno...)
Affinity DataIC50:  4.52E+4nM. Assay description: Data Source: Sanford-Burnham Center for Chemical Genomics (SBCCG) Source Affiliation: Sanford-Burnham Medical Research Institute (SBMRI, San Diego, C...
In DepthDetails PCBioAssay
TargetInduced myeloid leukemia cell differentiation protein Mcl-1(Homo sapiens (Human))
Emory University
Curated by PubChem BioAssay
LigandPNGBDBM44617(3-amino-6-(2-furanyl)-N-(2-methoxyphenyl)-2-thieno...)
Affinity DataIC50:  1.79E+3nM. Assay description: NIH Molecular Libraries Screening Centers Network [MLSCN] Emory Chemical Biology Discovery Center in MLSCN Assay provider: Nikolovska-Coleska, Univer...
In DepthDetails PCBioAssay