BDBM44619 (3aR,6aS)-5'-fluoranyl-5-(4-fluorophenyl)-1-[(4-hydroxyphenyl)methyl]spiro[1,2,3a,6a-tetrahydropyrrolo[3,4-c]pyrrole-3,3'-1H-indole]-2',4,6-trione::(3aR,6aS)-5'-fluoro-5-(4-fluorophenyl)-1-(4-hydroxybenzyl)spiro[1,2,3a,6a-tetrahydropyrrolo[3,4-c]pyrrole-3,3'-indoline]-2',4,6-trione::(3aR,6aS)-5'-fluoro-5-(4-fluorophenyl)-1-[(4-hydroxyphenyl)methyl]spiro[1,2,3a,6a-tetrahydropyrrolo[3,4-c]pyrrole-3,3'-1H-indole]-2',4,6-trione::MLS000083518::SMR000047767::cid_666561
SMILES Oc1c2C(Cc3ccc(O)cc3)NC3(C(=O)Nc4ccc(F)cc34)c2c(O)n1-c1ccc(F)cc1
InChI Key InChIKey=JXHRHYSVJIPBKT-UHFFFAOYSA-N
Data  1 EC50
  Tab Delimited (TSV)   2D SDfile   Computed 3D by Vconf -m prep SDfile
Find this compound or compounds like it in BindingDB:
Activity Spreadsheet -- Enzyme Inhibition Constant Data from BindingDB
Found 1 hit for monomerid = 44619
TargetMultidrug resistance-associated protein 1(Homo sapiens (Human))
Srmlsc
Curated by PubChem BioAssay
LigandPNGBDBM44619((3aR,6aS)-5'-fluoranyl-5-(4-fluorophenyl)-1-[(4-hy...)
Affinity DataEC50:  7.52E+3nM. Assay description: Southern Research Molecular Libraries Screening Center (SRMLSC) Southern Research Institute (Birmingham, Alabama) NIH Molecular Libraries Screening C...
In DepthDetails PCBioAssay