BDBM44623 MLS000083674::SMR000048354::cid_667061
SMILES Cc1ccc(CN2C(=O)NC(=O)C3(Cc4c(nc5ccccn5c4=O)N4CCCCCC34)C2=O)cc1
InChI Key InChIKey=OVTYLAWZUJAHIO-UHFFFAOYSA-N
Data  1 EC50
  Tab Delimited (TSV)   2D SDfile   Computed 3D by Vconf -m prep SDfile
Find this compound or compounds like it in BindingDB:
Activity Spreadsheet -- Enzyme Inhibition Constant Data from BindingDB
Found 1 hit for monomerid = 44623
TargetMultidrug resistance-associated protein 1(Homo sapiens (Human))
Srmlsc
Curated by PubChem BioAssay
LigandPNGBDBM44623(MLS000083674 | SMR000048354 | cid_667061)
Affinity DataEC50:  5.51E+3nM. Assay description: Southern Research Molecular Libraries Screening Center (SRMLSC) Southern Research Institute (Birmingham, Alabama) NIH Molecular Libraries Screening C...
In DepthDetails PCBioAssay