BDBM44624 MLS000054417::N-(4-bromanyl-2-fluoranyl-phenyl)-2-(1H-1,2,4-triazol-5-ylsulfanyl)ethanamide::N-(4-bromo-2-fluoro-phenyl)-2-(1H-1,2,4-triazol-5-ylthio)acetamide::N-(4-bromo-2-fluorophenyl)-2-(1H-1,2,4-triazol-5-ylsulfanyl)acetamide::N-(4-bromo-2-fluorophenyl)-2-(1H-1,2,4-triazol-5-ylthio)acetamide::SMR000066176::cid_2343370
SMILES Fc1cc(Br)ccc1NC(=O)CSc1nnc[nH]1
InChI Key InChIKey=HSKOKMVEFLXYLJ-UHFFFAOYSA-N
Data  1 IC50  1 EC50
  Tab Delimited (TSV)   2D SDfile   Computed 3D by Vconf -m prep SDfile
Find this compound or compounds like it in BindingDB:
Activity Spreadsheet -- Enzyme Inhibition Constant Data from BindingDB
Found 2 hits for monomerid = 44624
TargetM17 leucyl aminopeptidase(Plasmodium falciparum 3D7)
Srmlsc
Curated by PubChem BioAssay
LigandPNGBDBM44624(MLS000054417 | N-(4-bromanyl-2-fluoranyl-phenyl)-2...)
Affinity DataIC50:  2.98E+4nM. Assay description: Southern Research Molecular Libraries Screening Center (SRMLSC) Southern Research Institute (Birmingham, Alabama) NIH Molecular Libraries Screening...
In DepthDetails PCBioAssay
TargetMultidrug resistance-associated protein 1(Homo sapiens (Human))
Srmlsc
Curated by PubChem BioAssay
LigandPNGBDBM44624(MLS000054417 | N-(4-bromanyl-2-fluoranyl-phenyl)-2...)
Affinity DataEC50:  5.28E+3nM. Assay description: Southern Research Molecular Libraries Screening Center (SRMLSC) Southern Research Institute (Birmingham, Alabama) NIH Molecular Libraries Screening C...
In DepthDetails PCBioAssay