BDBM44635 (2Z)-2-[3-[2-(3-bromophenoxy)ethyl]-4-keto-thiazolidin-2-ylidene]acetic acid ethyl ester::(2Z)-2-[3-[2-(3-bromophenoxy)ethyl]-4-oxo-2-thiazolidinylidene]acetic acid ethyl ester::MLS000098301::SMR000067004::cid_5742519::ethyl (2Z)-2-[3-[2-(3-bromanylphenoxy)ethyl]-4-oxidanylidene-1,3-thiazolidin-2-ylidene]ethanoate::ethyl (2Z)-2-[3-[2-(3-bromophenoxy)ethyl]-4-oxo-1,3-thiazolidin-2-ylidene]acetate
SMILES CCOC(=O)\C=C1/SCC(=O)N1CCOc1cccc(Br)c1
InChI Key InChIKey=HIHOZGQVOONEEO-ZROIWOOFSA-N
Data  1 EC50
  Tab Delimited (TSV)   2D SDfile   Computed 3D by Vconf -m prep SDfile
Find this compound or compounds like it in BindingDB:
Activity Spreadsheet -- Enzyme Inhibition Constant Data from BindingDB
Found 1 hit for monomerid = 44635
TargetMultidrug resistance-associated protein 1(Homo sapiens (Human))
Srmlsc
Curated by PubChem BioAssay
LigandPNGBDBM44635((2Z)-2-[3-[2-(3-bromophenoxy)ethyl]-4-keto-thiazol...)
Affinity DataEC50:  6.50E+3nM. Assay description: Southern Research Molecular Libraries Screening Center (SRMLSC) Southern Research Institute (Birmingham, Alabama) NIH Molecular Libraries Screening C...
In DepthDetails PCBioAssay