BDBM446433 4-[2-[(3aS,6aS)-5-[(5R)-4,5,6,7-tetrahydro-1H-benzotriazole-5-carbonyl]-1,3,3a,4,6,6a-hexahydropyrrolo[3,4-c]pyrrol-2-yl]-2-oxoethoxy]-3-tert-butylbenzonitrile::US10669268, Example 19.31
SMILES CC(C)(C)c1cc(ccc1OCC(=O)N1C[C@@H]2CN(C[C@H]2C1)C(=O)[C@@H]1CCc2[nH]nnc2C1)C#N
InChI Key
Data  1 IC50
  Tab Delimited (TSV)   2D SDfile   Computed 3D by Vconf -m prep SDfile
Find this compound or compounds like it in BindingDB:
Activity Spreadsheet -- Enzyme Inhibition Constant Data from BindingDB
Found 1 hit for monomerid = 446433
TargetAtaxin-1(Homo sapiens (Human))
Hoffmann-La Roche
US Patent
LigandPNGBDBM446433(4-[2-[(3aS,6aS)-5-[(5R)-4,5,6,7-tetrahydro-1H-benz...)
Affinity DataIC50:  2nM. Assay description: ATX inhibition was measured by a fluorescence quenching assay using a specifically labeled substrate analogue (MR121 substrate). To obtain this MR121...
Ligand InfoPC cidPC sid
In DepthDetails US Patent