BDBM44646 4-[4-(3-methoxyphenyl)-6-(trifluoromethyl)-2-pyrimidinyl]-1-piperazinecarboxylic acid ethyl ester::4-[4-(3-methoxyphenyl)-6-(trifluoromethyl)pyrimidin-2-yl]piperazine-1-carboxylic acid ethyl ester::MLS000044548::SMR000022325::cid_3238796::ethyl 4-[4-(3-methoxyphenyl)-6-(trifluoromethyl)pyrimidin-2-yl]piperazine-1-carboxylate
SMILES CCOC(=O)N1CCN(CC1)c1nc(cc(n1)C(F)(F)F)-c1cccc(OC)c1
InChI Key InChIKey=HHUUIMGDNKEJNU-UHFFFAOYSA-N
Data  1 EC50
  Tab Delimited (TSV)   2D SDfile   Computed 3D by Vconf -m prep SDfile
Find this compound or compounds like it in BindingDB:
Activity Spreadsheet -- Enzyme Inhibition Constant Data from BindingDB
Found 1 hit for monomerid = 44646
TargetMultidrug resistance-associated protein 1(Homo sapiens (Human))
Srmlsc
Curated by PubChem BioAssay
LigandPNGBDBM44646(4-[4-(3-methoxyphenyl)-6-(trifluoromethyl)-2-pyrim...)
Affinity DataEC50:  6.02E+3nM. Assay description: Southern Research Molecular Libraries Screening Center (SRMLSC) Southern Research Institute (Birmingham, Alabama) NIH Molecular Libraries Screening C...
In DepthDetails PCBioAssay