BDBM44648 2-[[2-[(5-cyano-4-keto-6-phenyl-1H-pyrimidin-2-yl)thio]acetyl]amino]-4-methyl-valeric acid methyl ester::2-[[2-[(5-cyano-4-oxo-6-phenyl-1H-pyrimidin-2-yl)thio]-1-oxoethyl]amino]-4-methylpentanoic acid methyl ester::MLS000094938::SMR000030492::cid_3239149::methyl 2-[2-[(5-cyano-4-oxidanylidene-6-phenyl-1H-pyrimidin-2-yl)sulfanyl]ethanoylamino]-4-methyl-pentanoate::methyl 2-[[2-[(5-cyano-4-oxo-6-phenyl-1H-pyrimidin-2-yl)sulfanyl]acetyl]amino]-4-methylpentanoate
SMILES COC(=O)C(CC(C)C)NC(=O)CSc1nc(-c2ccccc2)c(C#N)c(=O)[nH]1
InChI Key InChIKey=AKPKVAZBSUXKSJ-UHFFFAOYSA-N
Data  2 EC50
  Tab Delimited (TSV)   2D SDfile   Computed 3D by Vconf -m prep SDfile
Find this compound or compounds like it in BindingDB:
Activity Spreadsheet -- Enzyme Inhibition Constant Data from BindingDB
Found 2 hits for monomerid = 44648
TargetGlycogen synthase kinase-3 beta(Homo sapiens (Human))
Broad Institute
Curated by PubChem BioAssay
LigandPNGBDBM44648(2-[[2-[(5-cyano-4-keto-6-phenyl-1H-pyrimidin-2-yl)...)
Affinity DataEC50: >3.00E+5nM. Assay description: Keywords: GSK3beta, dose response, kinase, inhibition, HTS Assay Overview: The glycogen synthase kinase-3 beta (GSK-3b) is a known master regulator f...
In DepthDetails PCBioAssay
TargetMultidrug resistance-associated protein 1(Homo sapiens (Human))
Srmlsc
Curated by PubChem BioAssay
LigandPNGBDBM44648(2-[[2-[(5-cyano-4-keto-6-phenyl-1H-pyrimidin-2-yl)...)
Affinity DataEC50:  1.00E+4nM. Assay description: Southern Research Molecular Libraries Screening Center (SRMLSC) Southern Research Institute (Birmingham, Alabama) NIH Molecular Libraries Screening C...
In DepthDetails PCBioAssay