BDBM44753 MLS000117135::N-[3-(2-furyl)-1-methyl-propyl]-3-keto-2-(4-methoxyphenyl)isoindoline-4-carboxamide::N-[4-(2-furanyl)butan-2-yl]-2-(4-methoxyphenyl)-3-oxo-1H-isoindole-4-carboxamide::N-[4-(furan-2-yl)butan-2-yl]-2-(4-methoxyphenyl)-3-oxidanylidene-1H-isoindole-4-carboxamide::N-[4-(furan-2-yl)butan-2-yl]-2-(4-methoxyphenyl)-3-oxo-1H-isoindole-4-carboxamide::SMR000094088::cid_5309709
SMILES COc1ccc(cc1)N1Cc2cccc(C(=O)NC(C)CCc3ccco3)c2C1=O
InChI Key InChIKey=RRAHONTZUQKQPP-UHFFFAOYSA-N
Data  2 IC50  1 EC50
  Tab Delimited (TSV)   2D SDfile   Computed 3D by Vconf -m prep SDfile
Find this compound or compounds like it in BindingDB:
Activity Spreadsheet -- Enzyme Inhibition Constant Data from BindingDB
Found 3 hits for monomerid = 44753
TargetMultidrug resistance-associated protein 1(Homo sapiens (Human))
Srmlsc
Curated by PubChem BioAssay
LigandPNGBDBM44753(MLS000117135 | N-[3-(2-furyl)-1-methyl-propyl]-3-k...)
Affinity DataEC50:  2.02E+3nM. Assay description: Southern Research Molecular Libraries Screening Center (SRMLSC) Southern Research Institute (Birmingham, Alabama) NIH Molecular Libraries Screening C...
In DepthDetails PCBioAssay
TargetPolyadenylate-binding protein 1(Homo sapiens (Human))
Burnham Center For Chemical Genomics
Curated by PubChem BioAssay
LigandPNGBDBM44753(MLS000117135 | N-[3-(2-furyl)-1-methyl-propyl]-3-k...)
Affinity DataIC50: >1.00E+5nM. Assay description: Data Source: Sanford-Burnham Center for Chemical Genomics (SBCCG) Source Affiliation: Sanford-Burnham Medical Research Institute(SBMRI, San Diego, CA...
In DepthDetails PCBioAssay
TargetEukaryotic translation initiation factor 4H(Homo sapiens (Human))
Burnham Center For Chemical Genomics
Curated by PubChem BioAssay
LigandPNGBDBM44753(MLS000117135 | N-[3-(2-furyl)-1-methyl-propyl]-3-k...)
Affinity DataIC50:  5.42E+3nM. Assay description: Data Source: Sanford-Burnham Center for Chemical Genomics (SBCCG) Source Affiliation: Sanford-Burnham Medical Research Institute (SBIMR, San Diego, C...
In DepthDetails PCBioAssay