BDBM450099 US10703755, Example 280
SMILES COc1nc(C)c2nc(-c3cncc(F)c3)n(Cc3ccc(CN4C[C@@H]5C[C@H]4CN5C)cc3F)c2n1
InChI Key InChIKey=AMSIKSHNBGELPD-SFTDATJTSA-N
Data  1 IC50
  Tab Delimited (TSV)   2D SDfile   Computed 3D by Vconf -m prep SDfile
Find this compound or compounds like it in BindingDB:
Activity Spreadsheet -- Enzyme Inhibition Constant Data from BindingDB
Found 1 hit for monomerid = 450099
TargetToll-like receptor 7(Homo sapiens (Human))
Sumitomo Dainippon Pharma
US Patent
LigandPNGBDBM450099(US10703755, Example 280)
Affinity DataIC50:  3nM. Assay description: As human TLR7 expressing cell line, HEK293 cell line was bought from IMGENEX Corporation (TLR7/NF-ηB/SEAPorter™ HEK293 cell), which is human emb...
Ligand InfoPC cidPC sid
In DepthDetails US Patent