BDBM450151 US10703755, Example 344
SMILES COc1nc(C)c2nc(-c3cccc(c3)C#N)n(Cc3ccc(cc3F)C3CN4CCC3CC4)c2n1
InChI Key InChIKey=RFHSDJHUMHLKRW-UHFFFAOYSA-N
Data  1 IC50
  Tab Delimited (TSV)   2D SDfile   Computed 3D by Vconf -m prep SDfile
Find this compound or compounds like it in BindingDB:
Activity Spreadsheet -- Enzyme Inhibition Constant Data from BindingDB
Found 1 hit for monomerid = 450151
TargetToll-like receptor 7(Homo sapiens (Human))
Sumitomo Dainippon Pharma
US Patent
LigandPNGBDBM450151(US10703755, Example 344)
Affinity DataIC50:  12nM. Assay description: As human TLR7 expressing cell line, HEK293 cell line was bought from IMGENEX Corporation (TLR7/NF-ηB/SEAPorter™ HEK293 cell), which is human emb...
Ligand InfoPC cidPC sid
In DepthDetails US Patent