BDBM450820 US10676469, Compound 35::US11124504, Cpd. No. 35
SMILES COc1cc(F)c2nc(N3CCC(CC3)NC3COC3)c(-c3nc(C)no3)c(C)c2c1
InChI Key InChIKey=WFRQQOURAAOAMZ-UHFFFAOYSA-N
Data  2 IC50
  Tab Delimited (TSV)   2D SDfile   Computed 3D by Vconf -m prep SDfile
Find this compound or compounds like it in BindingDB:
Activity Spreadsheet -- Enzyme Inhibition Constant Data from BindingDB
Found 2 hits for monomerid = 450820
TargetMu-type opioid receptor(Homo sapiens (Human))
Blackthorn Therapeutics
US Patent
LigandPNGBDBM450820(US10676469, Compound 35 | US11124504, Cpd. No. 35)
Affinity DataIC50: >1.00E+3nM. Assay description: The purpose of this assay is to confirm the potency and selectivity of compounds synthesized to be OPRK1 Antagonists. This assay monitors the OPRMu1 ...
Ligand InfoPC cidPC sid
In DepthDetails US Patent
TargetKappa-type opioid receptor(Homo sapiens (Human))
Blackthorn Therapeutics
US Patent
LigandPNGBDBM450820(US10676469, Compound 35 | US11124504, Cpd. No. 35)
Affinity DataIC50: >100nM. Assay description: The cell line for the OPRK1 antagonist assay stably expresses the following elements: The carboxy terminus of the OPRK1 receptor has a 7-amino acid l...
Ligand InfoPC cidPC sid
In DepthDetails US Patent