BDBM450966 US10676469, Compound 245::US11124504, Cpd. No. 245
SMILES C[C@@H]1C[C@@H](CCN1c1nc2c(cc(C)cc2c(C)c1-c1nc(C)no1)C#N)NCC1CCOCC1
InChI Key InChIKey=LYMWUYJGRHPDGA-VGOFRKELSA-N
Data  2 IC50
  Tab Delimited (TSV)   2D SDfile   Computed 3D by Vconf -m prep SDfile
Find this compound or compounds like it in BindingDB:
Activity Spreadsheet -- Enzyme Inhibition Constant Data from BindingDB
Found 2 hits for monomerid = 450966
TargetMu-type opioid receptor(Homo sapiens (Human))
Blackthorn Therapeutics
US Patent
LigandPNGBDBM450966(US10676469, Compound 245 | US11124504, Cpd. No. 24...)
Affinity DataIC50:  55nM. Assay description: The purpose of this assay is to confirm the potency and selectivity of compounds synthesized to be OPRK1 Antagonists. This assay monitors the OPRMu1 ...
Ligand InfoPC cidPC sid
In DepthDetails US Patent
TargetKappa-type opioid receptor(Homo sapiens (Human))
Blackthorn Therapeutics
US Patent
LigandPNGBDBM450966(US10676469, Compound 245 | US11124504, Cpd. No. 24...)
Affinity DataIC50:  5.5nM. Assay description: The cell line for the OPRK1 antagonist assay stably expresses the following elements: The carboxy terminus of the OPRK1 receptor has a 7-amino acid l...
Ligand InfoPC cidPC sid
In DepthDetails US Patent