BDBM451120 US10676485, Example 30
SMILES CN1CCN(C[C@@H]2COc3ccc(OCc4ccnc(n4)C4COCCOC4)c(C[C@@H](Oc4ncnc5sc(c(-c6c(C)c(Cl)c(O2)c(Cl)c6C)c45)-c2ccc(F)cc2)C(O)=O)c3)CC1
InChI Key InChIKey=IWBJIKJRSYPDHV-QZCRLSDHSA-N
Data  2 KI
  Tab Delimited (TSV)   2D SDfile   Computed 3D by Vconf -m prep SDfile
Find this compound or compounds like it in BindingDB:
Activity Spreadsheet -- Enzyme Inhibition Constant Data from BindingDB
Found 2 hits for monomerid = 451120
TargetInduced myeloid leukemia cell differentiation protein Mcl-1(Homo sapiens (Human))
Abbvie
US Patent
LigandPNGBDBM451120(US10676485, Example 30)
Affinity DataKi:  0.0150nM. Assay description: The ability of the exemplary MCL-1 inhibitors of Examples 1 through 151 to bind MCL-1 was demonstrated using the Time Resolved-Fluorescence Resonance...
Ligand InfoPC cidPC sid
In DepthDetails US Patent
TargetInduced myeloid leukemia cell differentiation protein Mcl-1(Homo sapiens (Human))
Abbvie
US Patent
LigandPNGBDBM451120(US10676485, Example 30)
Affinity DataKi:  0.160nM. Assay description: The ability of the exemplary MCL-1 inhibitors of Examples 1 through 151 to bind MCL-1 was demonstrated using the Time Resolved-Fluorescence Resonance...
Ligand InfoPC cidPC sid
In DepthDetails US Patent