BDBM454358 US10717734, Compound 34
SMILES Cc1c(Cc2ccc(cc2C)S(C)(=O)=O)c2ncccc2n1C\C(F)=C\CN
InChI Key InChIKey=SPWGPEBXVUBGMH-IUXPMGMMSA-N
Data  4 IC50
  Tab Delimited (TSV)   2D SDfile   Computed 3D by Vconf -m prep SDfile
Find this compound or compounds like it in BindingDB:
Activity Spreadsheet -- Enzyme Inhibition Constant Data from BindingDB
Found 4 hits for monomerid = 454358
TargetOxidized low-density lipoprotein receptor 1(Bovine)
Pharmaxis
US Patent
LigandPNGBDBM454358(US10717734, Compound 34)
Affinity DataIC50: >3.00E+5nM. Assay description: LOX and LOXL2: Lysyl oxidase (LOX) is an extracellular copper dependent enzyme which oxidizes peptidyl lysine and hydroxylysine residues in collagen ...
Ligand InfoPC cidPC sid
In DepthDetails US Patent
TargetAmine oxidase [flavin-containing] B(Homo sapiens (Human))
Pharmaxis
US Patent
LigandPNGBDBM454358(US10717734, Compound 34)
Affinity DataIC50: >3.00E+3nM. Assay description: MAO-B: The specificity of the compounds of this invention was tested by determining their ability to inhibit MAO-B activities in vitro. Recombinant h...
Ligand InfoPC cidPC sid
In DepthDetails US Patent
TargetMembrane primary amine oxidase(Homo sapiens (Human))
Pharmaxis
US Patent
LigandPNGBDBM454358(US10717734, Compound 34)
Affinity DataIC50: >3.00E+3nM. Assay description: SSAO/VAP-1: Human recombinant SSAO/VAP-1 amine oxidase activity was determined using the coupled colorimetric method as described for monoamine oxida...
Ligand InfoPC cidPC sid
In DepthDetails US Patent
TargetLysyl oxidase homolog 2(Homo sapiens (Human))
Pharmaxis
US Patent
LigandPNGBDBM454358(US10717734, Compound 34)
Affinity DataIC50: <3.00E+5nM. Assay description: LOX and LOXL2: Lysyl oxidase (LOX) is an extracellular copper dependent enzyme which oxidizes peptidyl lysine and hydroxylysine residues in collagen ...
Ligand InfoPC cidPC sid
In DepthDetails US Patent