BDBM456920 US10736974, Entry 23
SMILES CSc1ccc(cc1)C(=O)NCCCC(=O)N[C@H](CNC(=O)N[C@@H](CCC(O)=O)C(O)=O)OC=O
InChI Key InChIKey=PMZPLUNZVGCTTK-RDJZCZTQSA-N
Data  1 KI  1 IC50
  Tab Delimited (TSV)   2D SDfile   Computed 3D by Vconf -m prep SDfile
Find this compound or compounds like it in BindingDB:
Activity Spreadsheet -- Enzyme Inhibition Constant Data from BindingDB
Found 2 hits for monomerid = 456920
TargetGlutamate carboxypeptidase 2(Homo sapiens (Human))
The Johns Hopkins University
US Patent
LigandPNGBDBM456920(US10736974, Entry 23)
Affinity DataKi:  0.260nM. Assay description: The PSMA inhibitory activity was determined using a modification of the fluorescence-based Amplex Red Glutamic Acid Assay. Briefly, lysates of LNCaP ...
Ligand InfoPC cidPC sid
In DepthDetails US Patent
TargetGlutamate carboxypeptidase 2(Homo sapiens (Human))
The Johns Hopkins University
US Patent
LigandPNGBDBM456920(US10736974, Entry 23)
Affinity DataIC50:  1.30nM. Assay description: The PSMA inhibitory activity was determined using a modification of the fluorescence-based Amplex Red Glutamic Acid Assay. Briefly, lysates of LNCaP ...
Ligand InfoPC cidPC sid
In DepthDetails US Patent