BDBM456921 US10736974, Entry 24
SMILES OC(=O)CC[C@H](NC(=O)NC[C@@H](NC(=O)CCCNC(=O)c1ccc(cc1F)-c1ccccc1)OC=O)C(O)=O
InChI Key InChIKey=FZEMLFPWZBSVFN-UNMCSNQZSA-N
Data  1 KI  1 IC50
  Tab Delimited (TSV)   2D SDfile   Computed 3D by Vconf -m prep SDfile
Find this compound or compounds like it in BindingDB:
Activity Spreadsheet -- Enzyme Inhibition Constant Data from BindingDB
Found 1 hit for monomerid = 456921
TargetGlutamate carboxypeptidase 2(Homo sapiens (Human))
The Johns Hopkins University
US Patent
LigandPNGBDBM456921(US10736974, Entry 24)
Affinity DataIC50:  2nM. Assay description: The PSMA inhibitory activity was determined using a modification of the fluorescence-based Amplex Red Glutamic Acid Assay. Briefly, lysates of LNCaP ...
Ligand InfoPC cidPC sid
In DepthDetails US Patent