BDBM458563 5-{2-[4-(1,2-Benzoisoxazol-3-yl)piperidin-1-yl]ethyl}-2,3-dimethyl-2,5,6,7-tetrahydro-4H-pyrazolo[4,3-c]pyridin-4-one::US10745401, Example 37::US11466007, Example 37
SMILES Cc1c2c(CCN(CCN3CCC(CC3)c3noc4ccccc34)C2=O)nn1C
InChI Key InChIKey=HUZCEKOWDSLRDU-UHFFFAOYSA-N
Data  6 KI
  Tab Delimited (TSV)   2D SDfile   Computed 3D by Vconf -m prep SDfile
Find this compound or compounds like it in BindingDB:
Activity Spreadsheet -- Enzyme Inhibition Constant Data from BindingDB
Found 6 hits for monomerid = 458563
Target5-hydroxytryptamine receptor 2A(Homo sapiens (Human))
Sumitomo Pharma
US Patent
LigandPNGBDBM458563(5-{2-[4-(1,2-Benzoisoxazol-3-yl)piperidin-1-yl]eth...)
Affinity DataKi:  0.370nM. Assay description: Present compound for human 5-HT1A receptor, human 5-HT2A receptor, and human D2 receptor was measured by the following procedures. CHO cell membrane ...
Ligand InfoPC cidPC sid
In DepthDetails US Patent
Target5-hydroxytryptamine receptor 2A(Homo sapiens (Human))
Sumitomo Pharma
US Patent
LigandPNGBDBM458563(5-{2-[4-(1,2-Benzoisoxazol-3-yl)piperidin-1-yl]eth...)
Affinity DataKi:  0.370nM. Assay description: Binding affinity of the present compound for human 5-HT1A receptor, human 5-HT2A receptor, and human D2 receptor was measured by the following proced...
Ligand InfoPC cidPC sid
In DepthDetails US Patent
Target5-hydroxytryptamine receptor 1A(Homo sapiens (Human))
Sumitomo Dainippon Pharma
US Patent
LigandPNGBDBM458563(5-{2-[4-(1,2-Benzoisoxazol-3-yl)piperidin-1-yl]eth...)
Affinity DataKi:  2.68nM. Assay description: Binding affinity of the present compound for human 5-HT1A receptor, human 5-HT2A receptor, and human D2 receptor was measured by the following proced...
Ligand InfoPC cidPC sid
In DepthDetails US Patent
Target5-hydroxytryptamine receptor 1A(Homo sapiens (Human))
Sumitomo Dainippon Pharma
US Patent
LigandPNGBDBM458563(5-{2-[4-(1,2-Benzoisoxazol-3-yl)piperidin-1-yl]eth...)
Affinity DataKi:  2.68nM. Assay description: Present compound for human 5-HT1A receptor, human 5-HT2A receptor, and human D2 receptor was measured by the following procedures. CHO cell membrane ...
Ligand InfoPC cidPC sid
In DepthDetails US Patent
TargetD(2) dopamine receptor(Homo sapiens (Human))
Sumitomo Pharma
US Patent
LigandPNGBDBM458563(5-{2-[4-(1,2-Benzoisoxazol-3-yl)piperidin-1-yl]eth...)
Affinity DataKi:  267nM. Assay description: Present compound for human 5-HT1A receptor, human 5-HT2A receptor, and human D2 receptor was measured by the following procedures. CHO cell membrane ...
Ligand InfoPC cidPC sid
In DepthDetails US Patent
TargetD(2) dopamine receptor(Homo sapiens (Human))
Sumitomo Pharma
US Patent
LigandPNGBDBM458563(5-{2-[4-(1,2-Benzoisoxazol-3-yl)piperidin-1-yl]eth...)
Affinity DataKi:  267nM. Assay description: Binding affinity of the present compound for human 5-HT1A receptor, human 5-HT2A receptor, and human D2 receptor was measured by the following proced...
Ligand InfoPC cidPC sid
In DepthDetails US Patent