BDBM458693 US10745401, Example 166::US11466007, Example 166
SMILES Cc1cc2c(CCCN(CCN3CCC(CC3)c3noc4ccccc34)C2=O)n1C
InChI Key InChIKey=HIVKGGQTWNURAT-UHFFFAOYSA-N
Data  6 KI
  Tab Delimited (TSV)   2D SDfile   Computed 3D by Vconf -m prep SDfile
Find this compound or compounds like it in BindingDB:
Activity Spreadsheet -- Enzyme Inhibition Constant Data from BindingDB
Found 6 hits for monomerid = 458693
Target5-hydroxytryptamine receptor 1A(Homo sapiens (Human))
Sumitomo Dainippon Pharma
US Patent
LigandPNGBDBM458693(US10745401, Example 166 | US11466007, Example 166)
Affinity DataKi:  0.170nM. Assay description: Binding affinity of the present compound for human 5-HT1A receptor, human 5-HT2A receptor, and human D2 receptor was measured by the following proced...
Ligand InfoPC cidPC sid
In DepthDetails US Patent
Target5-hydroxytryptamine receptor 1A(Homo sapiens (Human))
Sumitomo Dainippon Pharma
US Patent
LigandPNGBDBM458693(US10745401, Example 166 | US11466007, Example 166)
Affinity DataKi:  0.170nM. Assay description: Present compound for human 5-HT1A receptor, human 5-HT2A receptor, and human D2 receptor was measured by the following procedures. CHO cell membrane ...
Ligand InfoPC cidPC sid
In DepthDetails US Patent
Target5-hydroxytryptamine receptor 2A(Homo sapiens (Human))
Sumitomo Pharma
US Patent
LigandPNGBDBM458693(US10745401, Example 166 | US11466007, Example 166)
Affinity DataKi:  2.31nM. Assay description: Present compound for human 5-HT1A receptor, human 5-HT2A receptor, and human D2 receptor was measured by the following procedures. CHO cell membrane ...
Ligand InfoPC cidPC sid
In DepthDetails US Patent
Target5-hydroxytryptamine receptor 2A(Homo sapiens (Human))
Sumitomo Pharma
US Patent
LigandPNGBDBM458693(US10745401, Example 166 | US11466007, Example 166)
Affinity DataKi:  2.31nM. Assay description: Binding affinity of the present compound for human 5-HT1A receptor, human 5-HT2A receptor, and human D2 receptor was measured by the following proced...
Ligand InfoPC cidPC sid
In DepthDetails US Patent
TargetD(2) dopamine receptor(Homo sapiens (Human))
Sumitomo Pharma
US Patent
LigandPNGBDBM458693(US10745401, Example 166 | US11466007, Example 166)
Affinity DataKi:  139nM. Assay description: Present compound for human 5-HT1A receptor, human 5-HT2A receptor, and human D2 receptor was measured by the following procedures. CHO cell membrane ...
Ligand InfoPC cidPC sid
In DepthDetails US Patent
TargetD(2) dopamine receptor(Homo sapiens (Human))
Sumitomo Pharma
US Patent
LigandPNGBDBM458693(US10745401, Example 166 | US11466007, Example 166)
Affinity DataKi:  139nM. Assay description: Binding affinity of the present compound for human 5-HT1A receptor, human 5-HT2A receptor, and human D2 receptor was measured by the following proced...
Ligand InfoPC cidPC sid
In DepthDetails US Patent