BDBM458880 US10759793, Example 32
SMILES OCC(=O)N1CCC[C@H](C1)Nc1nc(nc(-c2cn[nH]c2)c1F)-c1cnn2ccccc12
InChI Key InChIKey=IILSYWHBZRJVTF-CQSZACIVSA-N
Data  3 IC50
  Tab Delimited (TSV)   2D SDfile   Computed 3D by Vconf -m prep SDfile
Find this compound or compounds like it in BindingDB:
Activity Spreadsheet -- Enzyme Inhibition Constant Data from BindingDB
Found 3 hits for monomerid = 458880
TargetTyrosine-protein kinase JAK3 [795-1124](Homo sapiens (Human))
Almirall
US Patent
LigandPNGBDBM458880(US10759793, Example 32)
Affinity DataIC50:  4nM. Assay description: The catalytic domains of human JAK1 (aa 850-1154), JAK2 (aa 826-1132), JAK3 (aa 795-1124) and Tyk2 (aa 871-1187) were expressed as N-terminal GST-fus...
Ligand InfoPC cidPC sid
In DepthDetails US Patent
TargetTyrosine-protein kinase JAK1 [850-1154]()
Almirall
US Patent
LigandPNGBDBM458880(US10759793, Example 32)
Affinity DataIC50:  2nM. Assay description: The catalytic domains of human JAK1 (aa 850-1154), JAK2 (aa 826-1132), JAK3 (aa 795-1124) and Tyk2 (aa 871-1187) were expressed as N-terminal GST-fus...
Ligand InfoPC cidPC sid
In DepthDetails US Patent
TargetTyrosine-protein kinase JAK2 [826-1132](Homo sapiens (Human))
Almirall
US Patent
LigandPNGBDBM458880(US10759793, Example 32)
Affinity DataIC50:  0.600nM. Assay description: The catalytic domains of human JAK1 (aa 850-1154), JAK2 (aa 826-1132), JAK3 (aa 795-1124) and Tyk2 (aa 871-1187) were expressed as N-terminal GST-fus...
Ligand InfoPC cidPC sid
In DepthDetails US Patent