BDBM463399 3-amino-N-[2-(3-chlorophenoxy)ethyl]-1-({4-[(2-oxopiperidin-1-::US10781181, Example 77
SMILES Nc1nn(Cc2ccc(CN3CCCCC3=O)cc2)cc1C(=O)NCCOc1cccc(Cl)c1
InChI Key InChIKey=ODYDFHAUZLVWPR-UHFFFAOYSA-N
Data  2 IC50
  Tab Delimited (TSV)   2D SDfile   Computed 3D by Vconf -m prep SDfile
Find this compound or compounds like it in BindingDB:
Activity Spreadsheet -- Enzyme Inhibition Constant Data from BindingDB
Found 2 hits for monomerid = 463399
TargetKallikrein-1(Homo sapiens (Human))
Kalvista Pharmaceuticals
US Patent
LigandPNGBDBM463399(3-amino-N-[2-(3-chlorophenoxy)ethyl]-1-({4-[(2-oxo...)
Affinity DataIC50: >4.00E+4nM. Assay description: KLK1 inhibitory activity in vitro was determined using standard published methods. Human KLK1 (Callbiochem) was incubated at 25° C. with the fluoroge...
Ligand InfoPC cidPC sid
In DepthDetails US Patent
TargetPlasma kallikrein(Homo sapiens (Human))
Kalvista Pharmaceuticals
US Patent
LigandPNGBDBM463399(3-amino-N-[2-(3-chlorophenoxy)ethyl]-1-({4-[(2-oxo...)
Affinity DataIC50:  112nM. Assay description: Plasma kallikrein inhibitory activity in vitro was determined using standard published methods. Human plasma kallikrein (Protogen) was incubated at 2...
Ligand InfoPC cidPC sid
In DepthDetails US Patent