BDBM464278 3-(5-(1H-pyrazol-4- yl)pyridin-2-yl)-8-(2- hydroxyethyl)-1-(3- methoxybenzyl)- 1,3,8- triazaspiro[4.5]decan- 2-one::US10787450, Example 159
SMILES COc1cccc(CN2C(=O)N(CC22CCN(CCO)CC2)c2ccc(cn2)-c2cn[nH]c2)c1
InChI Key InChIKey=ZFOOQDARBILWHL-UHFFFAOYSA-N
Data  1 IC50
  Tab Delimited (TSV)   2D SDfile   Computed 3D by Vconf -m prep SDfile
Find this compound or compounds like it in BindingDB:
Activity Spreadsheet -- Enzyme Inhibition Constant Data from BindingDB
Found 1 hit for monomerid = 464278
TargetRho-associated protein kinase 2(Homo sapiens (Human))
Bristol-Myers Squibb
US Patent
LigandPNGBDBM464278(3-(5-(1H-pyrazol-4- yl)pyridin-2-yl)-8-(2- hydroxy...)
Affinity DataIC50: <3nM. Assay description: The effectiveness of compounds of the present invention as ROCK inhibitors can be determined in a 30 μL assay containing 20 mM HEPES, pH 7.5, 20...
Ligand InfoPC cidPC sid
In DepthDetails US Patent