BDBM464286 Preparation of 2-(3-(4-(1H-pyrazol-4-yl)phenyl)-1-(3-methoxybenzyl)-2-oxo-1,3,8-triazaspiro[4.5]decan-8-yl)-N-methylacetamide::US10787450, Example 168
SMILES CNC(=O)CN1CCC2(CN(C(=O)N2Cc2cccc(OC)c2)c2ccc(cc2)-c2cn[nH]c2)CC1
InChI Key InChIKey=OOZRFCRBNSPYQA-UHFFFAOYSA-N
Data  1 IC50
  Tab Delimited (TSV)   2D SDfile   Computed 3D by Vconf -m prep SDfile
Find this compound or compounds like it in BindingDB:
Activity Spreadsheet -- Enzyme Inhibition Constant Data from BindingDB
Found 1 hit for monomerid = 464286
TargetRho-associated protein kinase 2(Homo sapiens (Human))
Bristol-Myers Squibb
US Patent
LigandPNGBDBM464286(Preparation of 2-(3-(4-(1H-pyrazol-4-yl)phenyl)-1-...)
Affinity DataIC50: <3nM. Assay description: The effectiveness of compounds of the present invention as ROCK inhibitors can be determined in a 30 μL assay containing 20 mM HEPES, pH 7.5, 20...
Ligand InfoPC cidPC sid
In DepthDetails US Patent