BDBM464465 US10793528, Example SC_5035
SMILES COCCN1C(=O)N(CC(C)(C)C(N)=O)C[C@]11CC[C@@](CC1)(N(C)C)c1ccccc1
InChI Key InChIKey=FFAQBUUGOIIEFJ-PSWAGMNNSA-N
Data  2 KI
  Tab Delimited (TSV)   2D SDfile   Computed 3D by Vconf -m prep SDfile
Find this compound or compounds like it in BindingDB:
Activity Spreadsheet -- Enzyme Inhibition Constant Data from BindingDB
Found 2 hits for monomerid = 464465
TargetPrepronociceptin(Human)
GrÜNenthal
US Patent
LigandPNGBDBM464465(US10793528, Example SC_5035)
Affinity DataKi:  230nM. Assay description: NOP:The hNOP receptor binding assay was performed as homogeneous SPA-assay (scintillation proximity assay) using the assay buffer 50 mM TRIS-HCl. 10 ...
Ligand InfoPC cidPC sid
In DepthDetails US Patent
TargetMu-type opioid receptor(Homo sapiens (Human))
GrÜNenthal
US Patent
LigandPNGBDBM464465(US10793528, Example SC_5035)
Affinity DataKi:  815nM. Assay description: MOP: The hMOP receptor binding assay was performed as homogeneous SPA-assay (scintillation proximity assay) using the assay buffer 50 mM TRIS-HCl (pH...
Ligand InfoPC cidPC sid
In DepthDetails US Patent