BDBM46644 MLS-0107419.0001::N-[1,3-benzothiazol-2-yl(phenyl)phosphoryl]-2-methoxy-ethanamine::N-[1,3-benzothiazol-2-yl(phenyl)phosphoryl]-2-methoxyethanamine::[1,3-benzothiazol-2-yl(phenyl)phosphoryl]-(2-methoxyethyl)amine::cid_2308107
SMILES COCCNP(=O)(c1nc2ccccc2s1)c1ccccc1
InChI Key InChIKey=PKECRIJVRDXCKN-UHFFFAOYSA-N
Data  2 IC50
  Tab Delimited (TSV)   2D SDfile   Computed 3D by Vconf -m prep SDfile
Find this compound or compounds like it in BindingDB:
Activity Spreadsheet -- Enzyme Inhibition Constant Data from BindingDB
Found 1 hit for monomerid = 46644
TargetMannose-6-phosphate isomerase(Homo sapiens (Human))
Burnham Center For Chemical Genomics
Curated by PubChem BioAssay
LigandPNGBDBM46644(MLS-0107419.0001 | N-[1,3-benzothiazol-2-yl(phenyl...)
Affinity DataIC50: >5.00E+4nM. Assay description: Data Source: Sanford-Burnham Center for Chemical Genomics (SBCCG) Source Affiliation: Sanford-Burnham Medical Research Institute (SBMRI, San Diego, C...
In DepthDetails PCBioAssay