BDBM466815 US10800765, Example 33
SMILES Cc1c(C2=CS(=O)(=O)c3ccc(Cl)cc23)c2cc(F)ccc2n1CC(O)=O
InChI Key InChIKey=HIZFMKWTSKGNLT-UHFFFAOYSA-N
Data  1 IC50
  Tab Delimited (TSV)   2D SDfile   Computed 3D by Vconf -m prep SDfile
Find this compound or compounds like it in BindingDB:
Activity Spreadsheet -- Enzyme Inhibition Constant Data from BindingDB
Found 1 hit for monomerid = 466815
TargetProstaglandin D2 receptor 2(Homo sapiens (Human))
Chia Tai Tianqing Pharmaceutical Group
US Patent
LigandPNGBDBM466815(US10800765, Example 33)
Affinity DataIC50:  550nM. Assay description: Experimental Method:PathHunter CHO-K1 CRTH2 β-arrestin cells (DiscoverX, catalogue number 93-0291C2) grew under standard conditions, and were in...
Ligand InfoPC cidPC sid
In DepthDetails US Patent