BDBM466819 US10800765, Example 43::US10800765, Example 61
SMILES Cc1c(Cc2ccc3c(CCS3(=O)=O)c2)c2cc(F)ccc2n1CC(O)=O
InChI Key InChIKey=CVMCUBIEUMCWAG-UHFFFAOYSA-N
Data  2 IC50
  Tab Delimited (TSV)   2D SDfile   Computed 3D by Vconf -m prep SDfile
Find this compound or compounds like it in BindingDB:
Activity Spreadsheet -- Enzyme Inhibition Constant Data from BindingDB
Found 2 hits for monomerid = 466819
TargetProstaglandin D2 receptor 2(Homo sapiens (Human))
Chia Tai Tianqing Pharmaceutical Group
US Patent
LigandPNGBDBM466819(US10800765, Example 43 | US10800765, Example 61)
Affinity DataIC50:  550nM. Assay description: Experimental Method:PathHunter CHO-K1 CRTH2 β-arrestin cells (DiscoverX, catalogue number 93-0291C2) grew under standard conditions, and were in...
Ligand InfoPC cidPC sid
In DepthDetails US Patent
TargetProstaglandin D2 receptor 2(Homo sapiens (Human))
Chia Tai Tianqing Pharmaceutical Group
US Patent
LigandPNGBDBM466819(US10800765, Example 43 | US10800765, Example 61)
Affinity DataIC50: <100nM. Assay description: Experimental Method:PathHunter CHO-K1 CRTH2 β-arrestin cells (DiscoverX, catalogue number 93-0291C2) grew under standard conditions, and were in...
Ligand InfoPC cidPC sid
In DepthDetails US Patent