BDBM466840 US10800765, Example 64
SMILES CN1CC(F)(F)c2cc(Cc3c(C)n(CC(O)=O)c4ccc(F)cc34)c(cc2S1(=O)=O)C(F)(F)F
InChI Key InChIKey=AKYUJBFTXVUMBT-UHFFFAOYSA-N
Data  1 IC50
  Tab Delimited (TSV)   2D SDfile   Computed 3D by Vconf -m prep SDfile
Find this compound or compounds like it in BindingDB:
Activity Spreadsheet -- Enzyme Inhibition Constant Data from BindingDB
Found 1 hit for monomerid = 466840
TargetProstaglandin D2 receptor 2(Homo sapiens (Human))
Chia Tai Tianqing Pharmaceutical Group
US Patent
LigandPNGBDBM466840(US10800765, Example 64)
Affinity DataIC50:  550nM. Assay description: Experimental Method:PathHunter CHO-K1 CRTH2 β-arrestin cells (DiscoverX, catalogue number 93-0291C2) grew under standard conditions, and were in...
Ligand InfoPC cidPC sid
In DepthDetails US Patent