BDBM467246 (S)-3-(1-acryloylpiperidin-3-yl)-7-amino-1-(4- (2,3-difluorophenoxy)phenyl)-1,5-dihydro-4H- pyrazolo[3,4-d]pyridazin-4-one::US10800785, Example 62
SMILES Nc1n[nH]c(=O)c2c(nn(-c3ccc(Oc4cccc(F)c4F)cc3)c12)[C@H]1CCCN(C1)C(=O)C=C
InChI Key InChIKey=ITOFWEQGMWDMBM-AWEZNQCLSA-N
Data  1 IC50
  Tab Delimited (TSV)   2D SDfile   Computed 3D by Vconf -m prep SDfile
Find this compound or compounds like it in BindingDB:
Activity Spreadsheet -- Enzyme Inhibition Constant Data from BindingDB
Found 1 hit for monomerid = 467246
TargetTyrosine-protein kinase BTK(Homo sapiens (Human))
Shanghai Fochon Pharmaceutical
US Patent
LigandPNGBDBM467246((S)-3-(1-acryloylpiperidin-3-yl)-7-amino-1-(4- (2,...)
Affinity DataIC50:  147nM. Assay description: MTS testing kit was purchased from Promega. The DMEM, Fetal bovine serum and Penicillin-Streptomycin were purchased from Gibco. Dimethyl sulfoxide (D...
Ligand InfoPC cidPC sid
In DepthDetails US Patent