BDBM467279 (S,E)-7-amino-3-(1-(4-(dimethylamino)but-2- enoyl)piperidin-3-yl)-1-(4-phenoxyphenyl)-1,5- dihydro-4H-pyrrolo[2,3-d]pyridazin-4-one::US10800785, Example 103
SMILES CN(C)C\C=C\C(=O)N1CCC[C@H](C1)c1cn(-c2ccc(Oc3ccccc3)cc2)c2c(N)n[nH]c(=O)c12
InChI Key InChIKey=LJALPUPBPUNBMO-WUTDNEBXSA-N
Data  1 IC50
  Tab Delimited (TSV)   2D SDfile   Computed 3D by Vconf -m prep SDfile
Find this compound or compounds like it in BindingDB:
Activity Spreadsheet -- Enzyme Inhibition Constant Data from BindingDB
Found 1 hit for monomerid = 467279
TargetTyrosine-protein kinase BTK(Homo sapiens (Human))
Shanghai Fochon Pharmaceutical
US Patent
LigandPNGBDBM467279((S,E)-7-amino-3-(1-(4-(dimethylamino)but-2- enoyl)...)
Affinity DataIC50:  97nM. Assay description: MTS testing kit was purchased from Promega. The DMEM, Fetal bovine serum and Penicillin-Streptomycin were purchased from Gibco. Dimethyl sulfoxide (D...
Ligand InfoPC cidPC sid
In DepthDetails US Patent