BDBM467293 (R)-3-(1-acryloylpyrrolidin-3-yl)-7-amino-1-(4- (3,5-difluorophenoxy)phenyl)-1,5-dihydro-4H- pyrazolo[3,4-d]pyridazin-4-one::US10800785, Example 46
SMILES Nc1n[nH]c(=O)c2c(nn(-c3ccc(Oc4cc(F)cc(F)c4)cc3)c12)[C@@H]1CCN(C1)C(=O)C=C
InChI Key InChIKey=XCHLGWDOMMQTIY-CYBMUJFWSA-N
Data  1 IC50
  Tab Delimited (TSV)   2D SDfile   Computed 3D by Vconf -m prep SDfile
Find this compound or compounds like it in BindingDB:
Activity Spreadsheet -- Enzyme Inhibition Constant Data from BindingDB
Found 1 hit for monomerid = 467293
TargetTyrosine-protein kinase BTK(Homo sapiens (Human))
Shanghai Fochon Pharmaceutical
US Patent
LigandPNGBDBM467293((R)-3-(1-acryloylpyrrolidin-3-yl)-7-amino-1-(4- (3...)
Affinity DataIC50:  59nM. Assay description: MTS testing kit was purchased from Promega. The DMEM, Fetal bovine serum and Penicillin-Streptomycin were purchased from Gibco. Dimethyl sulfoxide (D...
Ligand InfoPC cidPC sid
In DepthDetails US Patent