BDBM473444 US10844044, Example 63
SMILES COc1cc(OC)cc(c1)C(NC(=O)c1cc(Cn2ccn(C)c2=N)cc(c1)-c1ccc(F)cc1OC(F)F)C1CC1
InChI Key InChIKey=UPYQUJZTFXEWMR-UHFFFAOYSA-N
Data  1 KI
  Tab Delimited (TSV)   2D SDfile   Computed 3D by Vconf -m prep SDfile
Find this compound or compounds like it in BindingDB:
Activity Spreadsheet -- Enzyme Inhibition Constant Data from BindingDB
Found 1 hit for monomerid = 473444
TargetWD repeat-containing protein 5(Homo sapiens (Human))
Vanderbilt University
US Patent
LigandPNGBDBM473444(US10844044, Example 63)
Affinity DataKi:  0.100nM. Assay description: A Time-Resolved Fluorescence Resonance Energy Transfer (TR-FRET) assay that measures the displacement of the 10mer-Thr-FAM probe in response to compo...
Ligand InfoPC cidPC sid
In DepthDetails US Patent