BDBM473446 US10844044, Example 245
SMILES COc1cc(OC)cc(c1)C(NC(=O)c1cc(Cn2ccoc2=N)cc(c1)-c1cccnc1C(F)(F)F)C1CC1
InChI Key InChIKey=WTIDKCAWSGFSIE-UHFFFAOYSA-N
Data  1 KI
  Tab Delimited (TSV)   2D SDfile   Computed 3D by Vconf -m prep SDfile
Find this compound or compounds like it in BindingDB:
Activity Spreadsheet -- Enzyme Inhibition Constant Data from BindingDB
Found 1 hit for monomerid = 473446
TargetWD repeat-containing protein 5(Homo sapiens (Human))
Vanderbilt University
US Patent
LigandPNGBDBM473446(US10844044, Example 245)
Affinity DataKi: <0.100nM. Assay description: A Time-Resolved Fluorescence Resonance Energy Transfer (TR-FRET) assay that measures the displacement of the 10mer-Thr-FAM probe in response to compo...
Ligand InfoPC cidPC sid
In DepthDetails US Patent