BDBM474460 US10881668, Compound 504
SMILES Cc1sc-2c(c1C)C(=N[C@H](CC(=O)NCC(F)F)c1nnc(C)n-21)c1ccc(Cl)cc1
InChI Key InChIKey=SKANTSCEPLCAJH-OAHLLOKOSA-N
Data  2 IC50
  Tab Delimited (TSV)   2D SDfile   Computed 3D by Vconf -m prep SDfile
Find this compound or compounds like it in BindingDB:
Activity Spreadsheet -- Enzyme Inhibition Constant Data from BindingDB
Found 2 hits for monomerid = 474460
TargetBromodomain-containing protein 4(Homo sapiens (Human))
Dana-Farber Cancer Institute
US Patent
LigandPNGBDBM474460(US10881668, Compound 504)
Affinity DataIC50:  27nM. Assay description: ssays were performed as described previously with minor modifications from the manufacturer's protocol (PerkinElmer, USA). All reagents were dilu...
Ligand InfoPC cidPC sid
In DepthDetails US Patent
TargetBromodomain testis-specific protein(Homo sapiens (Human))
Dana-Farber Cancer Institute
US Patent
LigandPNGBDBM474460(US10881668, Compound 504)
Affinity DataIC50:  69nM. Assay description: ssays were performed as described previously with minor modifications from the manufacturer's protocol (PerkinElmer, USA). All reagents were dilu...
Ligand InfoPC cidPC sid
In DepthDetails US Patent