BDBM474672 US10849883, Compound 98b::US11559515, Compound 98b
SMILES CC(C1CC1)N(CC(=O)NCc1cccc(Cl)c1F)C(=O)Cn1nc(C(N)=O)c2ccccc12
InChI Key InChIKey=GZQQCQNMTJARKR-UHFFFAOYSA-N
Data  2 IC50
  Tab Delimited (TSV)   2D SDfile   Computed 3D by Vconf -m prep SDfile
Find this compound or compounds like it in BindingDB:
Activity Spreadsheet -- Enzyme Inhibition Constant Data from BindingDB
Found 2 hits for monomerid = 474672
TargetComplement factor D(Homo sapiens (Human))
Biocryst Pharmaceuticals
US Patent
LigandPNGBDBM474672(US10849883, Compound 98b | US11559515, Compound 98...)
Affinity DataIC50: >1.00E+4nM. Assay description: An established esterolytic assay for the measurement of Factor D activity and inhibition of Factor D activity was used (Kam, C. M.; McRae, B. J.; Har...
Ligand InfoPC cidPC sid
In DepthDetails US Patent
TargetComplement factor D(Homo sapiens (Human))
Biocryst Pharmaceuticals
US Patent
LigandPNGBDBM474672(US10849883, Compound 98b | US11559515, Compound 98...)
Affinity DataIC50: <1.00E+3nM. Assay description: An established esterolytic assay for the measurement of Factor D activity and inhibition of Factor D activity was used (Kam, C. M.; McRae, B. J.; Har...
Ligand InfoPC cidPC sid
In DepthDetails US Patent