BDBM475479 1-[6-Chloro-5-(4-methoxy-phenylmethanesulfonyl)-1H-::US10851083, Example 91::US11618744, Example 91
SMILES COc1ccc(CS(=O)(=O)c2cc3nc([nH]c3cc2Cl)-n2cc(cn2)C(O)=O)cc1
InChI Key InChIKey=OHRLKYYIBYULOB-UHFFFAOYSA-N
Data  2 IC50
  Tab Delimited (TSV)   2D SDfile   Computed 3D by Vconf -m prep SDfile
Find this compound or compounds like it in BindingDB:
Activity Spreadsheet -- Enzyme Inhibition Constant Data from BindingDB
Found 2 hits for monomerid = 475479
TargetEgl nine homolog 1 [181-417](Homo sapiens (Human))
Janssen Pharmaceutica
US Patent
LigandPNGBDBM475479(1-[6-Chloro-5-(4-methoxy-phenylmethanesulfonyl)-1H...)
Affinity DataIC50:  20nM. Assay description: The PHD2 181-417 polypeptide (3 μg) was pre-incubated for 30 minutes with test compound prior to assessing the enzymatic activity of the polypep...
Ligand InfoPC cidPC sid
In DepthDetails US Patent
TargetEgl nine homolog 1 [181-417](Homo sapiens (Human))
Janssen Pharmaceutica
US Patent
LigandPNGBDBM475479(1-[6-Chloro-5-(4-methoxy-phenylmethanesulfonyl)-1H...)
Affinity DataIC50:  20nM. Assay description: The PHD2181-417 polypeptide (3 μg) was pre-incubated for 30 minutes with test compound prior to assessing the enzymatic activity of the polypept...
Ligand InfoPC cidPC sid
In DepthDetails US Patent