BDBM475493 1-[6-(Propane-2-sulfonyl)-5-trifluoromethoxy-1H-::US10851083, Example 105::US11618744, Example 105
SMILES CC(C)S(=O)(=O)c1cc2[nH]c(nc2cc1OC(F)(F)F)-n1cc(cn1)C(O)=O
InChI Key InChIKey=RATRDOACURPKIK-UHFFFAOYSA-N
Data  2 IC50
  Tab Delimited (TSV)   2D SDfile   Computed 3D by Vconf -m prep SDfile
Find this compound or compounds like it in BindingDB:
Activity Spreadsheet -- Enzyme Inhibition Constant Data from BindingDB
Found 2 hits for monomerid = 475493
TargetEgl nine homolog 1 [181-417](Homo sapiens (Human))
Janssen Pharmaceutica
US Patent
LigandPNGBDBM475493(1-[6-(Propane-2-sulfonyl)-5-trifluoromethoxy-1H- |...)
Affinity DataIC50:  39.8nM. Assay description: The PHD2 181-417 polypeptide (3 μg) was pre-incubated for 30 minutes with test compound prior to assessing the enzymatic activity of the polypep...
Ligand InfoPC cidPC sid
In DepthDetails US Patent
TargetEgl nine homolog 1 [181-417](Homo sapiens (Human))
Janssen Pharmaceutica
US Patent
LigandPNGBDBM475493(1-[6-(Propane-2-sulfonyl)-5-trifluoromethoxy-1H- |...)
Affinity DataIC50:  39.8nM. Assay description: The PHD2181-417 polypeptide (3 μg) was pre-incubated for 30 minutes with test compound prior to assessing the enzymatic activity of the polypept...
Ligand InfoPC cidPC sid
In DepthDetails US Patent