BDBM475568 1-[5-(2,4-Bis-trifluoromethyl-phenylmethanesulfonyl)-6-::US10851083, Example 180::US11618744, Example 180
SMILES OC(=O)c1cnn(c1)-c1nc2cc(c(Cl)cc2[nH]1)S(=O)(=O)Cc1ccc(cc1C(F)(F)F)C(F)(F)F
InChI Key InChIKey=DWINTOSYWDNYGR-UHFFFAOYSA-N
Data  2 IC50
  Tab Delimited (TSV)   2D SDfile   Computed 3D by Vconf -m prep SDfile
Find this compound or compounds like it in BindingDB:
Activity Spreadsheet -- Enzyme Inhibition Constant Data from BindingDB
Found 2 hits for monomerid = 475568
TargetEgl nine homolog 1 [181-417](Homo sapiens (Human))
Janssen Pharmaceutica
US Patent
LigandPNGBDBM475568(1-[5-(2,4-Bis-trifluoromethyl-phenylmethanesulfony...)
Affinity DataIC50:  25.1nM. Assay description: The PHD2 181-417 polypeptide (3 μg) was pre-incubated for 30 minutes with test compound prior to assessing the enzymatic activity of the polypep...
Ligand InfoPC cidPC sid
In DepthDetails US Patent
TargetEgl nine homolog 1 [181-417](Homo sapiens (Human))
Janssen Pharmaceutica
US Patent
LigandPNGBDBM475568(1-[5-(2,4-Bis-trifluoromethyl-phenylmethanesulfony...)
Affinity DataIC50:  25.1nM. Assay description: The PHD2181-417 polypeptide (3 μg) was pre-incubated for 30 minutes with test compound prior to assessing the enzymatic activity of the polypept...
Ligand InfoPC cidPC sid
In DepthDetails US Patent