BDBM477117 US10888567, Compound 12
SMILES Nc1noc2ncncc12
InChI Key InChIKey=REINGZOTPYBONL-UHFFFAOYSA-N
Data  1 IC50
  Tab Delimited (TSV)   2D SDfile   Computed 3D by Vconf -m prep SDfile
Find this compound or compounds like it in BindingDB:
Activity Spreadsheet -- Enzyme Inhibition Constant Data from BindingDB
Found 1 hit for monomerid = 477117
TargetIndoleamine 2,3-dioxygenase 1(Homo sapiens (Human))
Auckland Uniservices
US Patent
LigandPNGBDBM477117(US10888567, Compound 12)
Affinity DataIC50: >1.00E+5nM. Assay description: Recombinant human IDO1 (rhIDO1) was expressed and purified from cultures of EC538 strain of E. coli transformed with pREP4 and pQE9-IDO plasmid. Reac...
In DepthDetails US Patent