BDBM477139 US10888567, Compound 50
SMILES CCOC(=O)c1cc2c(N)noc2nc1C(F)(F)F
InChI Key InChIKey=BYLBQQJMXGJROC-UHFFFAOYSA-N
Data  1 IC50
  Tab Delimited (TSV)   2D SDfile   Computed 3D by Vconf -m prep SDfile
Find this compound or compounds like it in BindingDB:
Activity Spreadsheet -- Enzyme Inhibition Constant Data from BindingDB
Found 1 hit for monomerid = 477139
TargetIndoleamine 2,3-dioxygenase 1(Homo sapiens (Human))
Auckland Uniservices
US Patent
LigandPNGBDBM477139(US10888567, Compound 50)
Affinity DataIC50:  5.50E+4nM. Assay description: Recombinant human IDO1 (rhIDO1) was expressed and purified from cultures of EC538 strain of E. coli transformed with pREP4 and pQE9-IDO plasmid. Reac...
Ligand InfoPC cidPC sid
In DepthDetails US Patent